{"text_format":"1","workbook":"xlsx","n_sheets":5,"sheets":["kód","készlet","főkönyv","értékesítés","tranzakció"],"not_rendered":{"charts":3,"images":3,"macros":1,"external_links":0,"defined_names":5,"comments":0,"pivot_tables":0},"unopened":[],"bounds":{"document_bytes":16777216,"sheet_cells":100000,"rows_first":2000,"rows_last":500,"rows_between":2000,"halvings":0,"cell_chars":16384,"cell_head_chars":4096},"cells_cut":0,"cells_raw":0,"read":"whole","date_system":"1900"}

{"sheet":"kód","index":0,"n_rows":237,"n_cols":15,"rows_kept":237,"cut":false,"hidden":true,"merged":[]}
["CONTRACT ","DistrictCode","CustGroup","CatalogGroup","Curr","Year","Period","Account","CODE_B","CODE_C","LocationGroup","PrimeCommodity","desc","Period","PART_NO                   "]
["Telephely","Körzet","Vevőcsoport","Ért.csoport","Deviza","Év","Időszak","Számlaszám","CODE_B","CODE_C","Raktár csoport","Cikkcsoport-1",null,"Időszak","Cikkszám"]
[]
["10","B_BAZ         ","BELFÖLDI   ",1,"EUR",2008,0,211,"*","*","ALAP",1,"Alapanyag",1,"333"]
["010","B_BP          ","CN         ",2,"HUF",2009,1,311,"1-0-1","CS1","ATM",2,"Csomagoló anyag",2,"1010"]
["20","B_FEJ","KÜLFÖLDI   ",3,null,2010,2,384,"FROCS","TK1","ÉRK",4,"Félkész termék",3,"1212"]
["30",null,"PH         ","CS1           ",null,2011,3,4541,"K1","TK2","KI",5,"Késztermék",4,"2222"]
["40",null,null,"CS2    ",null,null,4,4542,"K2","TK4","KISZ","B               ","B csoport",5,"5632"]
["050",null,null,null,null,null,5,511,"K3","TK5","MEO","C               ","C csoport",6,"5633"]
["50",null,null,null,null,null,6,812,"K4",null,"RB","F     ","Fűszerkeverék                       ",7,"10001"]
["51",null,null,null,null,null,7,911,"K5",null,"RK",null,null,8,"10009"]
["060",null,null,null,null,null,8,null,"KA",null,"SZALL",null,null,9,"11001"]
["MRUHA",null,null,null,null,null,9,null,"MEO",null,"ÜZEM",null,null,10,"12005"]
["TE",null,null,null,null,null,10,null,"NBC",null,null,null,null,11,"12011"]
["TEST",null,null,null,null,null,11,null,"SK1",null,null,null,null,12,"12012"]
["TESTK",null,null,null,null,null,12,null,"SK3",null,null,null,null,null,"12023"]
["UM",null,null,null,null,null,null,null,null,null,null,null,null,null,"12035"]
["UT",null,null,null,null,null,null,null,null,null,null,null,null,null,"12047"]
[null,null,null,null,null,null,null,null,null,null,null,null,null,null,"12414"]
[null,null,null,null,null,null,null,null,null,null,null,null,null,null,"15068"]
[null,null,null,null,null,null,null,null,null,null,null,null,null,null,"15087"]
[null,null,null,null,null,null,null,null,null,null,null,null,null,null,"15090"]
[null,null,null,null,null,null,null,null,null,null,null,null,null,null,"15095"]
[null,null,null,null,null,null,null,null,null,null,null,null,null,null,"15131"]
[null,null,null,null,null,null,null,null,null,null,null,null,null,null,"15139"]
[null,null,null,null,null,null,null,null,null,null,null,null,null,null,"15146"]
[null,null,null,null,null,null,null,null,null,null,null,null,null,null,"15157"]
[null,null,null,null,null,null,null,null,null,null,null,null,null,null,"15183"]
[null,null,null,null,null,null,null,null,null,null,null,null,null,null,"15196"]
[null,null,null,null,null,null,null,null,null,null,null,null,null,null,"15210"]
[null,null,null,null,null,null,null,null,null,null,null,null,null,null,"18001"]
[null,null,null,null,null,null,null,null,null,null,null,null,null,null,"50-1-1"]
[null,null,null,null,null,null,null,null,null,null,null,null,null,null,"50-1"]
[null,null,null,null,null,null,null,null,null,null,null,null,null,null,"50-1-2"]
[null,null,null,null,null,null,null,null,null,null,null,null,null,null,"50-2"]
[null,null,null,null,null,null,null,null,null,null,null,null,null,null,"50-2-1"]
[null,null,null,null,null,null,null,null,null,null,null,null,null,null,"50-2-2"]
[null,null,null,null,null,null,null,null,null,null,null,null,null,null,"22345"]
[null,null,null,null,null,null,null,null,null,null,null,null,null,null,"22543"]
[null,null,null,null,null,null,null,null,null,null,null,null,null,null,"27025"]
{"$rows_left_out":198}
{"sheet":"készlet","index":1,"n_rows":22,"n_cols":4,"rows_kept":22,"cut":false,"hidden":false,"merged":[]}
[null,"N"]
["Vállalat",1000]
[]
["Dátumtól","2010-06-01"]
["Dátumig","2010-06-30"]
["Telephely"]
["Raktár"]
["Raktár csoport"]
["Raktárhely"]
["Termékcsalád"]
["Termékkód"]
["Cikkcsoport 1"]
["Cikkcsoport 2"]
["Cikkszám"]
["Könyvelési csoport"]
["Mértékegység"]
["Dátumtól","Dátumig","Készletváltozás","Készletváltozás"]
[null,null,"mennyiségben","értékben"]
["2011-04-01","2011-04-30",{"$f":"Raktar_Keszletvaltozas_MEnnyiseg($B$1,$B$2,$A19,$B19,$B$6,$B$7,$B$8,$B$9,$B$10,$B$11,$B$12,$B$13,$B$14,$B$15,$B$16)","v":0},{"$f":"Raktar_Keszletvaltozas_Ertek($B$1,$B$2,$A19,$B19,$B$6,$B$7,$B$8,$B$9,$B$10,$B$11,$B$12,$B$13,$B$14,$B$15,$B$16)","v":0}]
["2011-05-01","2011-05-31",{"$f":"Raktar_Keszletvaltozas_MEnnyiseg($B$1,$B$2,$A20,$B20,$B$6,$B$7,$B$8,$B$9,$B$10,$B$11,$B$12,$B$13,$B$14,$B$15,$B$16)","v":0},{"$f":"Raktar_Keszletvaltozas_Ertek($B$1,$B$2,$A20,$B20,$B$6,$B$7,$B$8,$B$9,$B$10,$B$11,$B$12,$B$13,$B$14,$B$15,$B$16)","v":0}]
["2011-06-01","2011-06-30",{"$f":"Raktar_Keszletvaltozas_MEnnyiseg($B$1,$B$2,$A21,$B21,$B$6,$B$7,$B$8,$B$9,$B$10,$B$11,$B$12,$B$13,$B$14,$B$15,$B$16)","v":0},{"$f":"Raktar_Keszletvaltozas_Ertek($B$1,$B$2,$A21,$B21,$B$6,$B$7,$B$8,$B$9,$B$10,$B$11,$B$12,$B$13,$B$14,$B$15,$B$16)","v":0}]
["B4 cella","B5 cella",{"$f":"Raktar_Keszletvaltozas_MEnnyiseg($B$1,$B$2,$B$4,$B$5,$B$6,$B$7,$B$8,$B$9,$B$10,$B$11,$B$12,$B$13,$B$14,$B$15,$B$16)","v":0},{"$f":"Raktar_Keszletvaltozas_Ertek($B$1,$B$2,$B$4,$B$5,$B$6,$B$7,$B$8,$B$9,$B$10,$B$11,$B$12,$B$13,$B$14,$B$15,$B$16)","v":0}]

{"sheet":"főkönyv","index":2,"n_rows":19,"n_cols":10,"rows_kept":19,"cut":false,"hidden":false,"merged":[]}
[null,"N"]
["Vállalat","1000",null,"Számla",4541,null,null,"F kódelem"]
[null,null,null,"B kódelem",{"$f":"+IF(INDEX(kód!I3:I16,kód!I237)>0,INDEX(kód!I3:I16,kód!I237),\"\")","v":""},"1-0-1",null,"G kódelem"]
["Könyvelési év",{"$f":"+IF(INDEX(kód!F3:F7,kód!F237)>0,INDEX(kód!F3:F7,kód!F237),\"\")","v":2011},null,"C kódelem",{"$f":"+IF(INDEX(kód!J3:J9,kód!J237)>0,INDEX(kód!J3:J9,kód!J237),\"\")","v":""},"TK1",null,"H kódelem"]
["Könyvelési periódustól",null,null,"D kódelem",null,null,null,"I kódelem"]
["Könyvelési periódusig",null,null,"E kódelem",null,null,null,"J kódelem"]
[]
[]
[]
["Főkönyvi szám","Nyitó","Forgalom","Záró","Forgalom","Záró",null,"Tartozik","Követel","check"]
[null,null,"II.név","II.név","III.név","III.név",null,"II.név","II.név"]
[null,"nyitó",4,"záró",7,"záró",null,4,4]
[null,null,6,6,9,9,null,6,6]
[211,{"$f":"Fokonyv_NyitoEgyenleg($B$1,$B$2,$B$4,$A14,$E$3,$E$4,$E$5,$E$6,$I$2,$I$3,$I$4,$I$5,$I$6)","v":0},{"$f":"Fokonyv_AllomanyValtozas($B$1,$B$2,$B$4,C$12,C$13,$A14,$E$3,$E$4,$E$5,$E$6,$I$2,$I$3,$I$4,$I$5,$I$6)","v":0},{"$f":"Fokonyv_ZaroEgyenleg($B$1,$B$2,D$13,$B$4,$A14,$E$3,$E$4,$E$5,$E$6,$I$2,$I$3,$I$4,$I$5,$I$6)","v":0},{"$f":"Fokonyv_AllomanyValtozas($B$1,$B$2,$B$4,E$12,E$13,$A14,$E$3,$E$4,$E$5,$E$6,$I$2,$I$3,$I$4,$I$5,$I$6)","v":0},{"$f":"Fokonyv_ZaroEgyenleg($B$1,$B$2,F$13,$B$4,$A14,$E$3,$E$4,$E$5,$E$6,$I$2,$I$3,$I$4,$I$5,$I$6)","v":0},null,{"$f":"Fokonyv_TartozikForgalom($B$1,$B$2,$B$4,H$12,H$13,$A14,$E$3,$E$4,$E$5,$E$6,$I$2,$I$3,$I$4,$I$5,$I$6)","v":0},{"$f":"Fokonyv_KovetelForgalom($B$1,$B$2,$B$4,H$12,H$13,$A14,$E$3,$E$4,$E$5,$E$6,$I$2,$I$3,$I$4,$I$5,$I$6)","v":0},{"$f":"+C14-H14+I14","v":0}]
[231,{"$f":"Fokonyv_NyitoEgyenleg($B$1,$B$2,$B$4,$A15,$E$3,$E$4,$E$5,$E$6,$I$2,$I$3,$I$4,$I$5,$I$6)","v":0},{"$f":"Fokonyv_AllomanyValtozas($B$1,$B$2,$B$4,C$12,C$13,$A15,$E$3,$E$4,$E$5,$E$6,$I$2,$I$3,$I$4,$I$5,$I$6)","v":0},{"$f":"Fokonyv_ZaroEgyenleg($B$1,$B$2,D$13,$B$4,$A15,$E$3,$E$4,$E$5,$E$6,$I$2,$I$3,$I$4,$I$5,$I$6)","v":0},{"$f":"Fokonyv_AllomanyValtozas($B$1,$B$2,$B$4,E$12,E$13,$A15,$E$3,$E$4,$E$5,$E$6,$I$2,$I$3,$I$4,$I$5,$I$6)","v":0},{"$f":"Fokonyv_ZaroEgyenleg($B$1,$B$2,F$13,$B$4,$A15,$E$3,$E$4,$E$5,$E$6,$I$2,$I$3,$I$4,$I$5,$I$6)","v":0},null,{"$f":"Fokonyv_TartozikForgalom($B$1,$B$2,$B$4,H$12,H$13,$A15,$E$3,$E$4,$E$5,$E$6,$I$2,$I$3,$I$4,$I$5,$I$6)","v":0},{"$f":"Fokonyv_KovetelForgalom($B$1,$B$2,$B$4,H$12,H$13,$A15,$E$3,$E$4,$E$5,$E$6,$I$2,$I$3,$I$4,$I$5,$I$6)","v":0},{"$f":"+C15-H15+I15","v":0}]
[529,{"$f":"Fokonyv_NyitoEgyenleg($B$1,$B$2,$B$4,$A16,$E$3,$E$4,$E$5,$E$6,$I$2,$I$3,$I$4,$I$5,$I$6)","v":0},{"$f":"Fokonyv_AllomanyValtozas($B$1,$B$2,$B$4,C$12,C$13,$A16,$E$3,$E$4,$E$5,$E$6,$I$2,$I$3,$I$4,$I$5,$I$6)","v":0},{"$f":"Fokonyv_ZaroEgyenleg($B$1,$B$2,D$13,$B$4,$A16,$E$3,$E$4,$E$5,$E$6,$I$2,$I$3,$I$4,$I$5,$I$6)","v":0},{"$f":"Fokonyv_AllomanyValtozas($B$1,$B$2,$B$4,E$12,E$13,$A16,$E$3,$E$4,$E$5,$E$6,$I$2,$I$3,$I$4,$I$5,$I$6)","v":0},{"$f":"Fokonyv_ZaroEgyenleg($B$1,$B$2,F$13,$B$4,$A16,$E$3,$E$4,$E$5,$E$6,$I$2,$I$3,$I$4,$I$5,$I$6)","v":0},null,{"$f":"Fokonyv_TartozikForgalom($B$1,$B$2,$B$4,H$12,H$13,$A16,$E$3,$E$4,$E$5,$E$6,$I$2,$I$3,$I$4,$I$5,$I$6)","v":0},{"$f":"Fokonyv_KovetelForgalom($B$1,$B$2,$B$4,H$12,H$13,$A16,$E$3,$E$4,$E$5,$E$6,$I$2,$I$3,$I$4,$I$5,$I$6)","v":0},0]
[541,{"$f":"Fokonyv_NyitoEgyenleg($B$1,$B$2,$B$4,$A17,$E$3,$E$4,$E$5,$E$6,$I$2,$I$3,$I$4,$I$5,$I$6)","v":0},{"$f":"Fokonyv_AllomanyValtozas($B$1,$B$2,$B$4,C$12,C$13,$A17,$E$3,$E$4,$E$5,$E$6,$I$2,$I$3,$I$4,$I$5,$I$6)","v":0},{"$f":"Fokonyv_ZaroEgyenleg($B$1,$B$2,D$13,$B$4,$A17,$E$3,$E$4,$E$5,$E$6,$I$2,$I$3,$I$4,$I$5,$I$6)","v":0},{"$f":"Fokonyv_AllomanyValtozas($B$1,$B$2,$B$4,E$12,E$13,$A17,$E$3,$E$4,$E$5,$E$6,$I$2,$I$3,$I$4,$I$5,$I$6)","v":0},{"$f":"Fokonyv_ZaroEgyenleg($B$1,$B$2,F$13,$B$4,$A17,$E$3,$E$4,$E$5,$E$6,$I$2,$I$3,$I$4,$I$5,$I$6)","v":0},null,{"$f":"Fokonyv_TartozikForgalom($B$1,$B$2,$B$4,H$12,H$13,$A17,$E$3,$E$4,$E$5,$E$6,$I$2,$I$3,$I$4,$I$5,$I$6)","v":0},{"$f":"Fokonyv_KovetelForgalom($B$1,$B$2,$B$4,H$12,H$13,$A17,$E$3,$E$4,$E$5,$E$6,$I$2,$I$3,$I$4,$I$5,$I$6)","v":0},0]
[9111,{"$f":"Fokonyv_NyitoEgyenleg($B$1,$B$2,$B$4,$A18,$E$3,$E$4,$E$5,$E$6,$I$2,$I$3,$I$4,$I$5,$I$6)","v":0},{"$f":"Fokonyv_AllomanyValtozas($B$1,$B$2,$B$4,C$12,C$13,$A18,$E$3,$E$4,$E$5,$E$6,$I$2,$I$3,$I$4,$I$5,$I$6)","v":0},{"$f":"Fokonyv_ZaroEgyenleg($B$1,$B$2,D$13,$B$4,$A18,$E$3,$E$4,$E$5,$E$6,$I$2,$I$3,$I$4,$I$5,$I$6)","v":0},{"$f":"Fokonyv_AllomanyValtozas($B$1,$B$2,$B$4,E$12,E$13,$A18,$E$3,$E$4,$E$5,$E$6,$I$2,$I$3,$I$4,$I$5,$I$6)","v":0},{"$f":"Fokonyv_ZaroEgyenleg($B$1,$B$2,F$13,$B$4,$A18,$E$3,$E$4,$E$5,$E$6,$I$2,$I$3,$I$4,$I$5,$I$6)","v":0},null,{"$f":"Fokonyv_TartozikForgalom($B$1,$B$2,$B$4,H$12,H$13,$A18,$E$3,$E$4,$E$5,$E$6,$I$2,$I$3,$I$4,$I$5,$I$6)","v":0},{"$f":"Fokonyv_KovetelForgalom($B$1,$B$2,$B$4,H$12,H$13,$A18,$E$3,$E$4,$E$5,$E$6,$I$2,$I$3,$I$4,$I$5,$I$6)","v":0},0]
["E2 cella",{"$f":"Fokonyv_NyitoEgyenleg($B$1,$B$2,$B$4,$E$2,$E$3,$E$4,$E$5,$E$6,$I$2,$I$3,$I$4,$I$5,$I$6)","v":0},{"$f":"Fokonyv_AllomanyValtozas($B$1,$B$2,$B$4,C$12,C$13,$E$2,$E$3,$E$4,$E$5,$E$6,$I$2,$I$3,$I$4,$I$5,$I$6)","v":0},{"$f":"Fokonyv_ZaroEgyenleg($B$1,$B$2,D$13,$B$4,$E$2,$E$3,$E$4,$E$5,$E$6,$I$2,$I$3,$I$4,$I$5,$I$6)","v":0},{"$f":"Fokonyv_AllomanyValtozas($B$1,$B$2,$B$4,E$12,E$13,$E$2,$E$3,$E$4,$E$5,$E$6,$I$2,$I$3,$I$4,$I$5,$I$6)","v":0},{"$f":"Fokonyv_ZaroEgyenleg($B$1,$B$2,F$13,$B$4,$E$2,$E$3,$E$4,$E$5,$E$6,$I$2,$I$3,$I$4,$I$5,$I$6)","v":0},null,{"$f":"Fokonyv_TartozikForgalom($B$1,$B$2,$B$4,H$12,H$13,$E$2,$E$3,$E$4,$E$5,$E$6,$I$2,$I$3,$I$4,$I$5,$I$6)","v":0},{"$f":"Fokonyv_KovetelForgalom($B$1,$B$2,$B$4,H$12,H$13,$E$2,$E$3,$E$4,$E$5,$E$6,$I$2,$I$3,$I$4,$I$5,$I$6)","v":0},{"$f":"+C19-H19+I19","v":0}]

{"sheet":"értékesítés","index":3,"n_rows":24,"n_cols":8,"rows_kept":24,"cut":false,"hidden":false,"merged":[]}
[null,"N"]
["Vállalat",1000]
[]
["Számla dátumtól","2009-03-01"]
["Számla dátumig","2009-06-30"]
["Telephely"]
["Vevőcsoport"]
["Vevőkód"]
["Értékesítési csoport"]
["Kereskedő"]
["Régió"]
["Körzet"]
["Piac"]
["Cikkszám"]
["Deviza"]
["Mértékegység"]
[]
[]
["Számla dátumtól","Számla dátumig","Számlázott mennyiség","Számlázott nettó (HUF)","Számlázott bruttó (HUF)","Ebből devizás bruttó (EUR)","Ebből devizás bruttó (HUF)","Ebből hazai  bruttó (HUF)"]
[null,null,null,null,null,"EUR","EUR","HUF"]
["2008-01-01","2008-12-31",{"$f":"Ertekesites_Szamlazott_Mennyiseg($B$1,$B$2,$A21,$B21,$B$6,$B$7,$B$8,$B$9,$B$10,$B$11,$B$12,$B$13,$B$14,$B$15,$B$16)","v":0},{"$f":"Ertekesites_Netto_Osszeg_HUF($B$1,$B$2,$A21,$B21,$B$6,$B$7,$B$8,$B$9,$B$10,$B$11,$B$12,$B$13,$B$14,$B$15,$B$16)","v":0},{"$f":"Ertekesites_Brutto_Osszeg_HUF($B$1,$B$2,$A21,$B21,$B$6,$B$7,$B$8,$B$9,$B$10,$B$11,$B$12,$B$13,$B$14,$B$15,$B$16)","v":0},{"$f":"Ertekesites_Brutto_Osszeg_Eredeti_Deviza($B$1,$B$2,$A21,$B21,$B$6,$B$7,$B$8,$B$9,$B$10,$B$11,$B$12,$B$13,$B$14,$F$20,$B$16)","v":0},{"$f":"Ertekesites_Brutto_Osszeg_HUF($B$1,$B$2,$A21,$B21,$B$6,$B$7,$B$8,$B$9,$B$10,$B$11,$B$12,$B$13,$B$14,$G$20,$B$16)","v":0},{"$f":"Ertekesites_Brutto_Osszeg_Eredeti_Deviza($B$1,$B$2,$A21,$B21,$B$6,$B$7,$B$8,$B$9,$B$10,$B$11,$B$12,$B$13,$B$14,$H$20,$B$16)","v":0}]
["2009-01-01","2009-12-31",{"$f":"Ertekesites_Szamlazott_Mennyiseg($B$1,$B$2,$A22,$B22,$B$6,$B$7,$B$8,$B$9,$B$10,$B$11,$B$12,$B$13,$B$14,$B$15,$B$16)","v":0},{"$f":"Ertekesites_Netto_Osszeg_HUF($B$1,$B$2,$A22,$B22,$B$6,$B$7,$B$8,$B$9,$B$10,$B$11,$B$12,$B$13,$B$14,$B$15,$B$16)","v":0},{"$f":"Ertekesites_Brutto_Osszeg_HUF($B$1,$B$2,$A22,$B22,$B$6,$B$7,$B$8,$B$9,$B$10,$B$11,$B$12,$B$13,$B$14,$B$15,$B$16)","v":0},{"$f":"Ertekesites_Brutto_Osszeg_Eredeti_Deviza($B$1,$B$2,$A22,$B22,$B$6,$B$7,$B$8,$B$9,$B$10,$B$11,$B$12,$B$13,$B$14,$F$20,$B$16)","v":0},{"$f":"Ertekesites_Brutto_Osszeg_HUF($B$1,$B$2,$A22,$B22,$B$6,$B$7,$B$8,$B$9,$B$10,$B$11,$B$12,$B$13,$B$14,$G$20,$B$16)","v":0},{"$f":"Ertekesites_Brutto_Osszeg_Eredeti_Deviza($B$1,$B$2,$A22,$B22,$B$6,$B$7,$B$8,$B$9,$B$10,$B$11,$B$12,$B$13,$B$14,$H$20,$B$16)","v":0}]
["2010-01-01","2010-12-31",{"$f":"Ertekesites_Szamlazott_Mennyiseg($B$1,$B$2,$A23,$B23,$B$6,$B$7,$B$8,$B$9,$B$10,$B$11,$B$12,$B$13,$B$14,$B$15,$B$16)","v":0},{"$f":"Ertekesites_Netto_Osszeg_HUF($B$1,$B$2,$A23,$B23,$B$6,$B$7,$B$8,$B$9,$B$10,$B$11,$B$12,$B$13,$B$14,$B$15,$B$16)","v":0},{"$f":"Ertekesites_Brutto_Osszeg_HUF($B$1,$B$2,$A23,$B23,$B$6,$B$7,$B$8,$B$9,$B$10,$B$11,$B$12,$B$13,$B$14,$B$15,$B$16)","v":0},{"$f":"Ertekesites_Brutto_Osszeg_Eredeti_Deviza($B$1,$B$2,$A23,$B23,$B$6,$B$7,$B$8,$B$9,$B$10,$B$11,$B$12,$B$13,$B$14,$F$20,$B$16)","v":0},{"$f":"Ertekesites_Brutto_Osszeg_HUF($B$1,$B$2,$A23,$B23,$B$6,$B$7,$B$8,$B$9,$B$10,$B$11,$B$12,$B$13,$B$14,$G$20,$B$16)","v":0},{"$f":"Ertekesites_Brutto_Osszeg_Eredeti_Deviza($B$1,$B$2,$A23,$B23,$B$6,$B$7,$B$8,$B$9,$B$10,$B$11,$B$12,$B$13,$B$14,$H$20,$B$16)","v":0}]
["B4 cella","B5 cella",{"$f":"Ertekesites_Szamlazott_Mennyiseg($B$1,$B$2,$B$4,$B$5,$B$6,$B$7,$B$8,$B$9,$B$10,$B$11,$B$12,$B$13,$B$14,$B$15,$B$16)","v":0},{"$f":"Ertekesites_Netto_Osszeg_HUF($B$1,$B$2,$B$4,$B$5,$B$6,$B$7,$B$8,$B$9,$B$10,$B$11,$B$12,$B$13,$B$14,$B$15,$B$16)","v":0},{"$f":"Ertekesites_Brutto_Osszeg_HUF($B$1,$B$2,$B$4,$B$5,$B$6,$B$7,$B$8,$B$9,$B$10,$B$11,$B$12,$B$13,$B$14,$B$15,$B$16)","v":0},{"$f":"Ertekesites_Brutto_Osszeg_Eredeti_Deviza($B$1,$B$2,$B$4,$B$5,$B$6,$B$7,$B$8,$B$9,$B$10,$B$11,$B$12,$B$13,$B$14,$F$20,$B$16)","v":0},{"$f":"Ertekesites_Brutto_Osszeg_HUF($B$1,$B$2,$B$4,$B$5,$B$6,$B$7,$B$8,$B$9,$B$10,$B$11,$B$12,$B$13,$B$14,$G$20,$B$16)","v":0},{"$f":"Ertekesites_Brutto_Osszeg_Eredeti_Deviza($B$1,$B$2,$B$4,$B$5,$B$6,$B$7,$B$8,$B$9,$B$10,$B$11,$B$12,$B$13,$B$14,$H$20,$B$16)","v":0}]

{"sheet":"tranzakció","index":4,"n_rows":389,"n_cols":26,"rows_kept":389,"cut":false,"hidden":true,"merged":[]}
[1000,2010,11,35,"0.Szállítói adott előleg",null,null,null,null,null,null,null,null,null,null,null,null,null,null,null,null,null,null,104000,104000,0]
[1000,2010,6,35,"0.Szállítói adott előleg",null,null,null,null,null,null,null,null,null,null,null,null,null,null,null,null,null,null,1480,1468,-12]
[1000,2010,11,466,"0.Beszerzések előz.felsz.ÁFA",null,null,null,null,null,null,null,null,null,null,null,null,null,null,null,null,null,null,8000,8000,0]
[1000,2011,5,541,"Időlejelentés bérktg",null,null,null,null,"HUF","Magyar Forint",null,null,"GYS","Györs.",null,null,null,null,null,null,null,null,0,0,0]
[1000,2008,5,541,"Időlejelentés bérktg",null,null,null,null,"HUF","Magyar Forint",null,null,"M1","M1",null,null,null,null,null,null,null,null,0,300000,300000]
[1000,2011,4,541,"Időlejelentés bérktg",null,null,null,null,"HUF","Magyar Forint",null,null,"SZENNA","1.szerződés",null,null,null,null,null,null,null,null,0,23750000,23750000]
[1000,2011,5,"0541E","Időlejelentés bérktg, ellenszámla",null,null,null,null,"HUF","Magyar Forint",null,null,null,null,null,null,null,null,null,null,null,null,0,0,0]
[1000,2008,5,"0541E","Időlejelentés bérktg, ellenszámla",null,null,null,null,"HUF","Magyar Forint",null,null,null,null,null,null,null,null,null,null,null,null,300000,0,-300000]
[1000,2011,4,"0541E","Időlejelentés bérktg, ellenszámla",null,null,null,null,"HUF","Magyar Forint",null,null,null,null,null,null,null,null,null,null,null,null,23750000,0,-23750000]
[1000,2009,2,131,"Termelô gépek, berendezések...",null,null,null,null,null,null,"B1002","Mérleg",null,null,null,null,null,null,null,null,null,null,0,2400000,2400000]
[1000,2010,10,131,"Termelô gépek, berendezések...",null,null,null,null,null,null,1010,"KM 150/1 fröccsgép",null,null,null,null,null,null,null,null,null,null,0,16500000,16500000]
[1000,2010,6,143,"Irodai, igazgatási ber. és felsz.",null,null,null,null,null,null,1003,"Töltőgép",null,null,null,null,null,null,null,null,null,null,0,360000,360000]
[1000,2009,3,143,"Irodai, igazgatási ber. és felsz.",null,null,null,null,null,null,"014MB1001","Szivattyú",null,null,null,null,null,null,null,null,null,null,0,180000,180000]
[1000,2009,3,149,"Egyéb berendezések terv sz écs.",null,null,null,null,"HUF","Magyar Forint","014MB1001","Szivattyú",null,null,null,null,null,null,null,null,null,null,968,0,-968]
[1000,2010,6,161,"Befejezetlen beruházások",null,null,null,null,"HUF","Magyar Forint",1003,"Töltőgép",null,null,null,null,null,null,null,null,null,null,360000,360000,0]
[1000,2009,2,161,"Befejezetlen beruházások",null,null,null,null,"HUF","Magyar Forint","B1002","Mérleg",null,null,null,null,null,null,null,null,null,null,2400000,0,-2400000]
[1000,2009,3,161,"Befejezetlen beruházások",null,null,null,null,"HUF","Magyar Forint","014MB1001","Szivattyú",null,null,null,null,null,null,null,null,null,null,180000,0,-180000]
[1000,2009,11,161,"Befejezetlen beruházások",null,null,null,null,"HUF","Magyar Forint",null,null,null,null,null,null,null,null,null,null,null,null,0,4000000,4000000]
[1000,2010,10,161,"Befejezetlen beruházások",null,null,null,null,"HUF","Magyar Forint",1010,"KM 150/1 fröccsgép",null,null,null,null,null,null,null,null,null,null,16500000,0,-16500000]
[1000,2011,5,211,"Alapanyagok","1-0-1","ktghely1 - 1-0-1","TK1","termékkód 1","HUF","Magyar Forint",null,null,"GYS2","Györs.",null,null,null,null,null,null,null,null,0,1320000,1320000]
[1000,2011,5,211,"Alapanyagok","*","*","*","termékkód*","HUF","Magyar Forint",null,null,"GYS2","Györs.",null,null,null,null,null,null,null,null,1320000,1320000,0]
[1000,2011,5,211,"Alapanyagok","*","*","*","termékkód*","HUF","Magyar Forint",null,null,null,null,null,null,null,null,null,null,null,null,502000,1500000,998000]
[1000,2011,5,211,"Alapanyagok","*","*","*","termékkód*","HUF","Magyar Forint",null,null,"GYS","Györs.",null,null,null,null,null,null,null,null,1320000,1820000,500000]
[1000,2008,9,211,"Alapanyagok","*","*","*","termékkód*","HUF","Magyar Forint",null,null,null,null,null,null,null,null,null,null,null,null,205085.05,502360480,502155394.94999999]
[1000,2009,3,211,"Alapanyagok","*","*","TK2","termékkód 2","HUF","Magyar Forint",null,null,null,null,null,null,null,null,null,null,null,null,643389.1,0,-643389.1]
[1000,2009,3,211,"Alapanyagok","*","*","*","termékkód*","HUF","Magyar Forint",null,null,null,null,null,null,null,null,null,null,null,null,321970.83,8627810,8305839.1699999999]
[1000,2011,4,211,"Alapanyagok","*","*","*","termékkód*","HUF","Magyar Forint",null,null,"SZENNA","1.szerződés",null,null,null,null,null,null,null,null,50000,50000,0]
[1000,2010,6,211,"Alapanyagok","*","*","*","termékkód*","HUF","Magyar Forint",null,null,null,null,null,null,null,null,null,null,null,null,3904091253.7199998,3907023046.23,2931792.51]
[1000,2011,6,211,"Alapanyagok","*","*","TK1","termékkód 1","HUF","Magyar Forint",null,null,null,null,null,null,null,null,null,null,null,null,27436200,257764995,230328795]
[1000,2011,4,211,"Alapanyagok","*","*","TK1","termékkód 1","HUF","Magyar Forint",null,null,null,null,null,null,null,null,null,null,null,null,5657300,6554560,897260]
[1000,2009,10,211,"Alapanyagok","*","*","TK1","termékkód 1","HUF","Magyar Forint",null,null,null,null,null,null,null,null,null,null,null,null,2260520,2260520,0]
[1000,2009,11,211,"Alapanyagok","*","*","*","termékkód*","HUF","Magyar Forint",null,null,null,null,null,null,null,null,null,null,null,null,132400,453500,321100]
[1000,2008,9,221,"Termelési segédanyag - Segédanyagok","*","*","*","termékkód*","HUF","Magyar Forint",null,null,null,null,null,null,null,null,null,null,null,null,2755620,7515115,4759495]
[1000,2009,3,221,"Termelési segédanyag - Segédanyagok","*","*","*","termékkód*","HUF","Magyar Forint",null,null,null,null,null,null,null,null,null,null,null,null,307235,335760,28525]
[1000,2010,6,229,"Anyagok értékvesztése",null,null,"TK2","termékkód 2","HUF","Magyar Forint",null,null,null,null,null,null,null,null,null,null,null,null,0,50,50]
[1000,2009,3,229,"Anyagok értékvesztése",null,null,"*","termékkód*","HUF","Magyar Forint",null,null,null,null,null,null,null,null,null,null,null,null,0,8000,8000]
[1000,2011,4,229,"Anyagok értékvesztése",null,null,"*","termékkód*","HUF","Magyar Forint",null,null,"SZENNA","1.szerződés",null,null,null,null,null,null,null,null,0,19950000,19950000]
[1000,2011,5,231,"Befejezetlen termelés","1-0-1","ktghely1 - 1-0-1","*","termékkód*",null,null,null,null,"GYS2","Györs.",null,null,null,null,null,null,null,null,2640000,2640000,0]
[1000,2011,5,231,"Befejezetlen termelés","1-0-1","ktghely1 - 1-0-1","*","termékkód*",null,null,null,null,"GYS","Györs.",null,null,null,null,null,null,null,null,2640000,2640000,0]
[1000,2008,9,231,"Befejezetlen termelés","*","*","*","termékkód*",null,null,null,null,null,null,null,null,null,null,null,null,null,null,2192392.33,1696532.49,-495859.84]
{"$rows_left_out":349}